{"text_format":"1","workbook":"xlsx","n_sheets":20,"sheets":["Instructions","META Data","Aero Forces 2a","Velocity Profile 2a","Surface Data 2a","Aero Forces 2b","Velocity Profile 2b","Surface Data 2b","Surface Data (Test 2a)","Surface Data (Test 2b)","Force Plots 2a","Velocity Plots 2a","Pressure Probe Plots 2a","Skin Friction Plot 2a","Force Plots 2b","Velocity Plots 2b","Pressure Probe Plots 2b","Skin Friction Plot 2b","FlowField 2a","FlowField 2b"],"not_rendered":{"charts":82,"images":45,"macros":1,"external_links":6,"defined_names":65,"comments":3,"pivot_tables":0},"unopened":[],"bounds":{"document_bytes":16777216,"sheet_cells":100000,"rows_first":2000,"rows_last":500,"rows_between":2000,"halvings":0,"cell_chars":16384,"cell_head_chars":4096},"cells_cut":0,"cells_raw":0,"read":"whole","date_system":"1900"}

{"sheet":"Instructions","index":0,"n_rows":0,"n_cols":0,"rows_kept":0,"cut":false,"hidden":false,"merged":[]}

{"sheet":"META Data","index":1,"n_rows":108,"n_cols":17,"rows_kept":108,"cut":false,"hidden":false,"merged":[[106,1,106,3],[50,9,50,17],[66,9,66,17],[70,9,70,17],[74,9,74,17],[98,1,98,2],[99,1,99,2],[100,1,100,2],[83,1,83,2],[84,1,84,2],[87,1,87,2],[88,1,88,2],[96,1,96,2],[70,1,70,4],[75,1,75,2],[76,1,76,2],[48,1,48,2],[52,1,52,2],[59,1,59,2],[50,1,50,2],[71,1,71,2],[64,1,64,2],[65,1,65,2],[68,1,68,2],[51,1,51,2],[60,1,60,2],[61,1,61,2],[62,1,62,2],[63,1,63,2],[66,1,66,4],[67,1,67,2],[28,1,28,2],[27,1,27,2],[29,1,29,2],[30,1,30,2],[31,1,31,4],[39,1,39,2],[45,1,45,2],[43,1,43,2],[42,1,42,2],[36,1,36,2],[37,1,37,2],[3,9,3,17],[8,9,8,17],[18,9,18,17],[25,9,25,17],[3,1,3,2],[15,1,15,2],[16,1,16,2],[18,1,18,2],[8,1,8,2],[10,1,10,2],[11,1,11,2],[12,1,12,2],[13,1,13,2],[14,1,14,2],[19,1,19,2],[20,1,20,2],[9,1,9,2],[5,1,5,2],[6,1,6,2],[22,1,22,2],[25,1,25,2],[23,1,23,2],[21,1,21,2],[26,1,26,2],[82,1,82,2],[78,1,78,2],[72,1,72,2],[74,1,74,2],[80,1,80,2],[81,1,81,2],[77,1,77,2],[79,1,79,2],[33,1,33,2],[32,1,32,2],[35,1,35,2],[46,1,46,2],[47,1,47,2],[38,1,38,4],[41,1,41,2]]}
[]
[null,"Required Input:"]
[]
[null,"DrivAer Test Case:",null,null,"Test case 2a","Test Case 2b \n(w/ Front Wheel Deflector)",null,"Example Input:",null,"Pull down options"]
[]
[null,"Submission relates to TFG:",null,null,null,null,null,"TFG2: Noise Factor",null,"TFG1 : Meshing","TFG2: Noise Factor","TFG3: AI/ML","TFG4: SRS","TFG5: HPC","Multiple"]
[null,"if \"Multiple\" entre manually:",null,null,null,null,null,"TFG2 / TFG5"]
[]
[null,"Analyst:"]
[null,"Participant ID:",null,null,null,null,null,"01"]
[null,"Lastname:",null,null,null,null,null,"Hupertz"]
[null,"Firstname:",null,null,null,null,null,"Burkhard"]
[null,"Affiliation:",null,null,null,null,null,"Ford"]
[null,"Email:",null,null,null,null,null,"bhupertz@ford.com"]
[null,"Date:",null,null,null,null,null,"2021-05-07"]
[null,"Legend Suffix:",null,null,null,null,null,"v1"]
[null,"Plot Legend (automatically completed):",null,null,{"$f":"\"ID\"&E10&\"_\"&E22&\"_\"&E16","v":"ID__"},{"$f":"\"ID\"&F10&\"_\"&F22&\"_\"&F16","v":"ID__"},null,{"$f":"\"ID\"&H10&\"_\"&H22&\"_\"&H16","v":"ID01_CCM+_v1"}]
[]
[null,"CFD/AI Software:"]
[null,"AI or CFD based solver:",null,null,null,null,null,null,null,"AI","CFD"]
{"$rows_left_out":89}
{"sheet":"Aero Forces 2a","index":2,"n_rows":304,"n_cols":20,"rows_kept":304,"cut":false,"hidden":false,"merged":[[39,2,67,9],[38,2,38,9],[23,2,23,7],[24,3,24,7],[25,3,25,7],[26,3,26,7],[27,3,27,7],[34,2,34,7],[9,3,11,3],[9,4,11,4],[9,5,11,5],[9,6,11,6],[35,2,35,7],[33,2,33,7],[22,2,22,7],[9,7,11,7],[17,2,17,7],[19,2,19,7],[20,2,20,7],[21,2,21,7],[9,2,11,2],[1,11,1,14],[1,16,1,19],[7,3,7,7],[1,2,1,10],[4,3,4,7],[3,2,3,9],[5,3,5,7],[4,8,4,9],[5,8,5,9]]}
[]
[null,null,"Aerodynamics Forces",null,null,null,null,null,null,null,null,"Simulation Stabilization/Convergence\n(Time history)",null,null,null,null,"Aerodynamic Force Development Plots"]
[null,null,null,null,null,null,null,null,null,null,null,"Time [s]","CD [-]","CL [-]","CS [-]",null,null,"x [mm]","CD [-]","CL [-]"]
[null,null,"Required input:",null,null,null,null,null,null,null,null,null,null,null,null,null,1]
[null,null,"1)","Aerodynamic forces (CD; CL; CLf; CLr; Cs)",null,null,null,null,"mandatory",null,null,null,null,null,null,null,2]
[null,null,"2)","Aerodynamic force development (CD; CL)",null,null,null,null,"recommended",null,null,null,null,null,null,null,3]
[null,null,null,null,null,null,null,null,null,null,null,null,null,null,null,null,4]
[null,null,"Simulation title:",{"$f":"'META Data'!E17","v":"ID__"},null,null,null,null,null,null,null,null,null,null,null,null,5]
[null,null,"Aero Force Coeff:","CD","CL","CLf","CLr","CS",null,null,null,null,null,null,null,null,6]
[null,null,"AVERAGE\n - based on participant best practice\n - will be used for aero force reporting",null,null,null,null,null,null,null,null,null,null,null,null,null,7]
[null,null,null,null,null,null,null,null,null,null,null,null,null,null,null,null,8]
[null,null,null,null,null,null,null,null,null,null,null,null,null,null,null,null,9]
[null,null,null,null,null,null,null,null,null,null,null,null,null,null,null,null,10]
[null,null,null,null,null,null,null,null,null,null,null,null,null,null,null,null,11]
[null,null,"Standardized Meancalc based evaluation of aero dynamic force time traces",null,null,null,null,null,null,null,null,null,null,null,null,null,12]
[null,null,"    - Meancalc output will not be used for aero force reporting and comparison!",null,null,null,null,null,null,null,null,null,null,null,null,null,13]
[null,null,"    - Meancalc output will be used for result quality checking and statistical error reporting",null,null,null,null,null,null,null,null,null,null,null,null,null,14]
[null,null,"    - Access Meancalc via: ",null,null,null,null,null,null,null,null,null,null,null,null,null,15]
[null,null,"           https://meancalc.app.upstream-cfd.com",null,null,null,null,null,null,null,null,null,null,null,null,null,16]
[null,null,"    - Define start point of averaging period (timestep)",null,null,null,null,null,null,null,null,null,null,null,null,null,17]
{"$rows_left_out":285}
{"sheet":"Velocity Profile 2a","index":3,"n_rows":10,"n_cols":33,"rows_kept":10,"cut":false,"hidden":false,"merged":[[8,23,8,24],[1,1,1,9],[3,1,3,8],[4,2,4,6],[4,7,4,8],[5,7,5,8],[7,1,7,32],[8,11,8,12],[8,1,8,2],[8,3,8,4],[8,5,8,6],[8,7,8,8],[8,9,8,10],[8,25,8,26],[8,27,8,28],[8,29,8,30],[8,31,8,32],[8,13,8,14],[8,15,8,16],[8,17,8,18],[8,19,8,20],[8,21,8,22]]}
[]
[null,"Velocity Profiles"]
[]
[null,"Required input:"]
[null,"1)","Normalized velocity magnitude profiles",null,null,null,null,"mandatory"]
[null,null,"Distance referes to starting point of the individual profiles (s. note)"]
[]
[null,{"$f":"'META Data'!E17","v":"ID__"}]
[null,"L1",null,"R1",null,"R2",null,"R3",null,"U1",null,"U2",null,"U3",null,"U4",null,"U5",null,"U6",null,"V1",null,"V2",null,"V3",null,"V4",null,"V5",null,"V6"]
[null,"Vmag/V∞ [-]","Distance [m]","Vmag/V∞ [-]","Distance [m]","Vmag/V∞ [-]","Distance [m]","Vmag/V∞ [-]","Distance [m]","Vmag/V∞ [-]","Distance [m]","Vmag/V∞ [-]","Distance [m]","Vmag/V∞ [-]","Distance [m]","Vmag/V∞ [-]","Distance [m]","Vmag/V∞ [-]","Distance [m]","Vmag/V∞ [-]","Distance [m]","Vmag/V∞ [-]","Distance [m]","Vmag/V∞ [-]","Distance [m]","Vmag/V∞ [-]","Distance [m]","Vmag/V∞ [-]","Distance [m]","Vmag/V∞ [-]","Distance [m]","Vmag/V∞ [-]","Distance [m]"]

{"sheet":"Surface Data 2a","index":4,"n_rows":218,"n_cols":11,"rows_kept":218,"cut":false,"hidden":false,"merged":[[1,1,1,10],[3,1,3,9],[4,2,4,8],[5,2,5,8],[184,1,217,1],[184,2,217,2],[184,3,217,3],[184,10,217,10],[158,1,183,1],[158,2,183,2],[158,3,183,3],[158,10,183,10],[144,1,157,1],[144,2,157,2],[144,3,157,3],[144,10,157,10],[128,1,133,1],[128,2,133,2],[128,3,133,3],[128,10,133,10],[134,1,143,1],[134,2,143,2],[134,3,143,3],[134,10,143,10],[105,1,116,1],[105,2,116,2],[105,3,116,3],[105,10,116,10],[117,1,127,1],[117,2,127,2],[117,3,127,3],[117,10,127,10],[74,1,101,1],[74,2,101,2],[74,3,101,3],[74,10,101,10],[102,1,104,1],[102,2,104,2],[102,3,104,3],[102,10,104,10],[52,1,62,1],[52,2,62,2],[52,3,62,3],[52,10,62,10],[63,1,73,1],[63,2,73,2],[63,3,73,3],[63,10,73,10],[9,10,31,10],[32,1,51,1],[32,2,51,2],[32,3,51,3],[32,10,51,10],[7,3,7,4],[9,1,31,1],[9,2,31,2],[9,3,31,3],[7,5,7,9]]}
[]
[null,"Surface Pressure"]
[]
[null,"Required input:"]
[null,"1)","Time averaged static pressure coefficient Cp at all pressure probe locations",null,null,null,null,null,null,"mandatory"]
[null,"2)","Time averaged upperbody skin centerline friction coefficient magnitude (Cf) at marked locations",null,null,null,null,null,null,"mandatory"]
[]
[null,null,null,"Simulation title:",null,{"$f":"'META Data'!E17","v":"ID__"}]
[null,null,"ANSA PID","# of Probes","Probe \n# ","X [mm]","Y [mm]","Z [mm]","Cp [-]","Cf [-]","Picture"]
[null,"Upperbody Centerline (TUM)","600 - PROBES - TUM Main body centerline",23,1,-798.25,0,150]
[null,null,null,null,2,-700,0,406.35]
[null,null,null,null,3,-600,0,462.63]
[null,null,null,null,4,-500,0,499.45]
[null,null,null,null,5,-400,0,527.70000000000005]
[null,null,null,null,6,-300,0,550.85]
[null,null,null,null,7,-100,0,587.73]
[null,null,null,null,8,0,0,603.04999999999995]
[null,null,null,null,9,100,0,616.9]
[null,null,null,null,10,300,0,640.83000000000004]
[null,null,null,null,11,350,0,645.92999999999995]
{"$rows_left_out":199}
{"sheet":"Aero Forces 2b","index":5,"n_rows":204,"n_cols":20,"rows_kept":204,"cut":false,"hidden":false,"merged":[[39,2,67,9],[27,3,27,7],[33,2,33,7],[34,2,34,7],[35,2,35,7],[38,2,38,9],[22,2,22,7],[23,2,23,7],[24,3,24,7],[25,3,25,7],[26,3,26,7],[9,7,11,7],[17,2,17,7],[19,2,19,7],[20,2,20,7],[21,2,21,7],[9,2,11,2],[9,3,11,3],[9,4,11,4],[9,5,11,5],[9,6,11,6],[7,3,7,7],[1,2,1,10],[1,11,1,14],[1,16,1,19],[3,2,3,9],[4,3,4,7],[4,8,4,9],[5,3,5,7],[5,8,5,9]]}
[]
[null,null,"Aerodynamics Forces",null,null,null,null,null,null,null,null,"Simulation Stabilization/Convergence\n(Time history)",null,null,null,null,"Aerodynamic Force Development Plots"]
[null,null,null,null,null,null,null,null,null,null,null,"Time [s]","CD [-]","CL [-]","CS [-]",null,null,"x [mm]","CD [-]","CL [-]"]
[null,null,"Required input:",null,null,null,null,null,null,null,null,null,null,null,null,null,1]
[null,null,"1)","Aerodynamic forces (CD; CL; CLf; CLr; Cs)",null,null,null,null,"mandatory",null,null,null,null,null,null,null,2]
[null,null,"2)","Aerodynamic force development (CD; CL)",null,null,null,null,"recommended",null,null,null,null,null,null,null,3]
[null,null,null,null,null,null,null,null,null,null,null,null,null,null,null,null,4]
[null,null,"Simulation title:",{"$f":"'META Data'!F17","v":"ID__"},null,null,null,null,null,null,null,null,null,null,null,null,5]
[null,null,"Aero Force Coeff:","CD","CL","CLf","CLr","CS",null,null,null,null,null,null,null,null,6]
[null,null,"AVERAGE\n - based on participant best practice\n - will be used for aero force reporting",null,null,null,null,null,null,null,null,null,null,null,null,null,7]
[null,null,null,null,null,null,null,null,null,null,null,null,null,null,null,null,8]
[null,null,null,null,null,null,null,null,null,null,null,null,null,null,null,null,9]
[null,null,null,null,null,null,null,null,null,null,null,null,null,null,null,null,10]
[null,null,null,null,null,null,null,null,null,null,null,null,null,null,null,null,11]
[null,null,"Standardized Meancalc based evaluation of aero dynamic force time traces",null,null,null,null,null,null,null,null,null,null,null,null,null,12]
[null,null,"    - Meancalc output will not be used for aero force reporting and comparison!",null,null,null,null,null,null,null,null,null,null,null,null,null,13]
[null,null,"    - Meancalc output will be used for result quality checking and statistical error reporting",null,null,null,null,null,null,null,null,null,null,null,null,null,14]
[null,null,"    - Access Meancalc via: ",null,null,null,null,null,null,null,null,null,null,null,null,null,15]
[null,null,"           https://meancalc.app.upstream-cfd.com",null,null,null,null,null,null,null,null,null,null,null,null,null,16]
[null,null,"    - Define start point of averaging period (timestep)",null,null,null,null,null,null,null,null,null,null,null,null,null,17]
{"$rows_left_out":185}
{"sheet":"Velocity Profile 2b","index":6,"n_rows":10,"n_cols":33,"rows_kept":10,"cut":false,"hidden":false,"merged":[[8,11,8,12],[1,1,1,9],[3,1,3,8],[4,2,4,6],[4,7,4,8],[5,7,5,8],[7,1,7,32],[8,1,8,2],[8,3,8,4],[8,5,8,6],[8,7,8,8],[8,9,8,10],[8,25,8,26],[8,27,8,28],[8,29,8,30],[8,31,8,32],[8,23,8,24],[8,13,8,14],[8,15,8,16],[8,17,8,18],[8,19,8,20],[8,21,8,22]]}
[]
[null,"Velocity Profiles"]
[]
[null,"Required input:"]
[null,"1)","Normalized velocity magnitude profiles",null,null,null,null,"mandatory"]
[null,null,"Distance referes to starting point of the individual profiles (s. note)"]
[]
[null,{"$f":"'META Data'!F17","v":"ID__"}]
[null,"L1",null,"R1",null,"R2",null,"R3",null,"U1",null,"U2",null,"U3",null,"U4",null,"U5",null,"U6",null,"V1",null,"V2",null,"V3",null,"V4",null,"V5",null,"V6"]
[null,"Vmag/V∞ [-]","Distance [m]","Vmag/V∞ [-]","Distance [m]","Vmag/V∞ [-]","Distance [m]","Vmag/V∞ [-]","Distance [m]","Vmag/V∞ [-]","Distance [m]","Vmag/V∞ [-]","Distance [m]","Vmag/V∞ [-]","Distance [m]","Vmag/V∞ [-]","Distance [m]","Vmag/V∞ [-]","Distance [m]","Vmag/V∞ [-]","Distance [m]","Vmag/V∞ [-]","Distance [m]","Vmag/V∞ [-]","Distance [m]","Vmag/V∞ [-]","Distance [m]","Vmag/V∞ [-]","Distance [m]","Vmag/V∞ [-]","Distance [m]","Vmag/V∞ [-]","Distance [m]"]

{"sheet":"Surface Data 2b","index":7,"n_rows":218,"n_cols":11,"rows_kept":218,"cut":false,"hidden":false,"merged":[[7,3,7,4],[1,1,1,10],[3,1,3,9],[4,2,4,8],[5,2,5,8],[7,5,7,9],[9,1,31,1],[9,2,31,2],[9,3,31,3],[9,10,31,10],[32,1,51,1],[32,2,51,2],[32,3,51,3],[32,10,51,10],[52,1,62,1],[52,2,62,2],[52,3,62,3],[52,10,62,10],[63,1,73,1],[63,2,73,2],[63,3,73,3],[63,10,73,10],[74,1,101,1],[74,2,101,2],[74,3,101,3],[74,10,101,10],[102,1,104,1],[102,2,104,2],[102,3,104,3],[102,10,104,10],[105,1,116,1],[105,2,116,2],[105,3,116,3],[105,10,116,10],[117,1,127,1],[117,2,127,2],[117,3,127,3],[117,10,127,10],[128,1,133,1],[128,2,133,2],[128,3,133,3],[128,10,133,10],[134,1,143,1],[134,2,143,2],[134,3,143,3],[134,10,143,10],[184,1,217,1],[184,2,217,2],[184,3,217,3],[184,10,217,10],[144,1,157,1],[144,2,157,2],[144,3,157,3],[144,10,157,10],[158,1,183,1],[158,2,183,2],[158,3,183,3],[158,10,183,10]]}
[]
[null,"Surface Pressure"]
[]
[null,"Required input:"]
[null,"1)","Time averaged static pressure coefficient Cp at all pressure probe locations",null,null,null,null,null,null,"mandatory"]
[null,"2)","Time averaged upperbody skin centerline friction coefficient magnitude (Cf) at marked locations",null,null,null,null,null,null,"mandatory"]
[]
[null,null,null,"Simulation title:",null,{"$f":"'META Data'!F17","v":"ID__"}]
[null,null,"ANSA PID","# of Probes","Probe \n# ","X [mm]","Y [mm]","Z [mm]","Cp [-]","Cf [-]","Picture"]
[null,"Upperbody Centerline (TUM)","600 - PROBES - TUM Main body centerline",23,1,-798.25,0,150]
[null,null,null,null,2,-700,0,406.35]
[null,null,null,null,3,-600,0,462.63]
[null,null,null,null,4,-500,0,499.45]
[null,null,null,null,5,-400,0,527.70000000000005]
[null,null,null,null,6,-300,0,550.85]
[null,null,null,null,7,-100,0,587.73]
[null,null,null,null,8,0,0,603.04999999999995]
[null,null,null,null,9,100,0,616.9]
[null,null,null,null,10,300,0,640.83000000000004]
[null,null,null,null,11,350,0,645.92999999999995]
{"$rows_left_out":199}
{"sheet":"Surface Data (Test 2a)","index":8,"n_rows":223,"n_cols":13,"rows_kept":223,"cut":false,"hidden":true,"merged":[[4,10,4,11],[6,1,48,1],[4,6,4,7],[1,1,1,9],[195,1,202,1],[142,1,151,1],[132,1,141,1],[124,1,131,1],[120,1,123,1],[109,1,119,1],[98,1,108,1],[71,1,97,1],[49,1,70,1],[203,1,222,1],[184,1,194,1],[171,1,183,1],[152,1,157,1],[158,1,170,1]]}
[]
[null,"Resorting of pressure data to enable plotting"]
[null,"To access wind tunnel test results unhide column G to I. Results will be displayed in \"Pressure Probe Plots\" sheet"]
[]
[null,null,null,null,null,null,"Cp [-]",null,"DCp[-]",null,"Cf [-]",null,"DCf[-]"]
[null,null,"Probe \n# ","X [mm]","Y [mm]","Z [mm]","Ford_Pininfarina_171116",{"$f":"'META Data'!E17","v":"ID__"},"Test - CFD",null,"CFD Reference Data",{"$f":"'META Data'!E17","v":"ID__"},"CFD - CFDRef"]
[null,"Upperbody Cenerline",1,-798.25,0,150,null,{"$f":"VLOOKUP(C7,'Surface Data 2a'!$E$10:$I$218,5,FALSE)","v":0},{"$f":"G7-H7","v":0},null,null,{"$f":"VLOOKUP(C7,'Surface Data 2a'!$E$10:$J$218,6,FALSE)","v":0},{"$f":"K7-L7","v":0}]
[null,null,195,-724.8,0,384.1,null,{"$f":"VLOOKUP(C8,'Surface Data 2a'!$E$10:$I$218,5,FALSE)","v":0},0,null,null,{"$f":"VLOOKUP(C8,'Surface Data 2a'!$E$10:$J$218,6,FALSE)","v":0},0]
[null,null,2,-700,0,406.35,null,{"$f":"VLOOKUP(C9,'Surface Data 2a'!$E$10:$I$218,5,FALSE)","v":0},0,null,null,{"$f":"VLOOKUP(C9,'Surface Data 2a'!$E$10:$J$218,6,FALSE)","v":0},0]
[null,null,3,-600,0,462.63,null,{"$f":"VLOOKUP(C10,'Surface Data 2a'!$E$10:$I$218,5,FALSE)","v":0},0,null,null,{"$f":"VLOOKUP(C10,'Surface Data 2a'!$E$10:$J$218,6,FALSE)","v":0},0]
[null,null,4,-500,0,499.45,null,{"$f":"VLOOKUP(C11,'Surface Data 2a'!$E$10:$I$218,5,FALSE)","v":0},0,null,null,{"$f":"VLOOKUP(C11,'Surface Data 2a'!$E$10:$J$218,6,FALSE)","v":0},0]
[null,null,5,-400,0,527.70000000000005,null,{"$f":"VLOOKUP(C12,'Surface Data 2a'!$E$10:$I$218,5,FALSE)","v":0},0,null,null,{"$f":"VLOOKUP(C12,'Surface Data 2a'!$E$10:$J$218,6,FALSE)","v":0},0]
[null,null,6,-300,0,550.85,null,{"$f":"VLOOKUP(C13,'Surface Data 2a'!$E$10:$I$218,5,FALSE)","v":0},0,null,null,{"$f":"VLOOKUP(C13,'Surface Data 2a'!$E$10:$J$218,6,FALSE)","v":0},0]
[null,null,7,-100,0,587.73,null,{"$f":"VLOOKUP(C14,'Surface Data 2a'!$E$10:$I$218,5,FALSE)","v":0},0,null,null,{"$f":"VLOOKUP(C14,'Surface Data 2a'!$E$10:$J$218,6,FALSE)","v":0},0]
[null,null,8,0,0,603.04999999999995,null,{"$f":"VLOOKUP(C15,'Surface Data 2a'!$E$10:$I$218,5,FALSE)","v":0},0,null,null,{"$f":"VLOOKUP(C15,'Surface Data 2a'!$E$10:$J$218,6,FALSE)","v":0},0]
[null,null,9,100,0,616.9,null,{"$f":"VLOOKUP(C16,'Surface Data 2a'!$E$10:$I$218,5,FALSE)","v":0},0,null,null,{"$f":"VLOOKUP(C16,'Surface Data 2a'!$E$10:$J$218,6,FALSE)","v":0},0]
[null,null,10,300,0,640.83000000000004,null,{"$f":"VLOOKUP(C17,'Surface Data 2a'!$E$10:$I$218,5,FALSE)","v":0},0,null,null,{"$f":"VLOOKUP(C17,'Surface Data 2a'!$E$10:$J$218,6,FALSE)","v":0},0]
[null,null,11,350,0,645.92999999999995,null,{"$f":"VLOOKUP(C18,'Surface Data 2a'!$E$10:$I$218,5,FALSE)","v":0},0,null,null,{"$f":"VLOOKUP(C18,'Surface Data 2a'!$E$10:$J$218,6,FALSE)","v":0},0]
[null,null,12,413.1,0,625,null,{"$f":"VLOOKUP(C19,'Surface Data 2a'!$E$10:$I$218,5,FALSE)","v":0},0,null,null,{"$f":"VLOOKUP(C19,'Surface Data 2a'!$E$10:$J$218,6,FALSE)","v":0},0]
[null,null,13,464.13,0,625,null,{"$f":"VLOOKUP(C20,'Surface Data 2a'!$E$10:$I$218,5,FALSE)","v":0},0,null,null,{"$f":"VLOOKUP(C20,'Surface Data 2a'!$E$10:$J$218,6,FALSE)","v":0},0]
{"$rows_left_out":204}
{"sheet":"Surface Data (Test 2b)","index":9,"n_rows":223,"n_cols":13,"rows_kept":223,"cut":false,"hidden":true,"merged":[[4,10,4,11],[152,1,157,1],[1,1,1,9],[4,6,4,7],[6,1,48,1],[49,1,70,1],[71,1,97,1],[98,1,108,1],[109,1,119,1],[120,1,123,1],[124,1,131,1],[132,1,141,1],[142,1,151,1],[158,1,170,1],[171,1,183,1],[184,1,194,1],[195,1,202,1],[203,1,222,1]]}
[]
[null,"Resorting of pressure data to enable plotting"]
[null,"To access wind tunnel test results unhide column G to I. Results will be displayed in \"Pressure Probe Plots\" sheet"]
[]
[null,null,null,null,null,null,"Cp [-]",null,"DCp[-]",null,"Cf [-]",null,"DCf[-]"]
[null,null,"Probe \n# ","X [mm]","Y [mm]","Z [mm]","Ford_Pininfarina_211125",{"$f":"'META Data'!F17","v":"ID__"},"Test - CFD",null,"CFD Reference Data",{"$f":"'META Data'!E17","v":"ID__"},"CFD - CFDRef"]
[null,"Upperbody Cenerline",1,-798.25,0,150,null,{"$f":"VLOOKUP(C7,'Surface Data 2b'!$E$10:$I$218,5,FALSE)","v":0},{"$f":"G7-H7","v":0},null,1,{"$f":"VLOOKUP(C7,'Surface Data 2b'!$E$10:$J$218,6,FALSE)","v":0},{"$f":"K7-L7","v":1}]
[null,null,195,-724.8,0,384.1,null,{"$f":"VLOOKUP(C8,'Surface Data 2b'!$E$10:$I$218,5,FALSE)","v":0},0,null,2,{"$f":"VLOOKUP(C8,'Surface Data 2b'!$E$10:$J$218,6,FALSE)","v":0},2]
[null,null,2,-700,0,406.35,null,{"$f":"VLOOKUP(C9,'Surface Data 2b'!$E$10:$I$218,5,FALSE)","v":0},0,null,3,{"$f":"VLOOKUP(C9,'Surface Data 2b'!$E$10:$J$218,6,FALSE)","v":0},3]
[null,null,3,-600,0,462.63,null,{"$f":"VLOOKUP(C10,'Surface Data 2b'!$E$10:$I$218,5,FALSE)","v":0},0,null,2,{"$f":"VLOOKUP(C10,'Surface Data 2b'!$E$10:$J$218,6,FALSE)","v":0},2]
[null,null,4,-500,0,499.45,null,{"$f":"VLOOKUP(C11,'Surface Data 2b'!$E$10:$I$218,5,FALSE)","v":0},0,null,1,{"$f":"VLOOKUP(C11,'Surface Data 2b'!$E$10:$J$218,6,FALSE)","v":0},1]
[null,null,5,-400,0,527.70000000000005,null,{"$f":"VLOOKUP(C12,'Surface Data 2b'!$E$10:$I$218,5,FALSE)","v":0},0,null,2,{"$f":"VLOOKUP(C12,'Surface Data 2b'!$E$10:$J$218,6,FALSE)","v":0},2]
[null,null,6,-300,0,550.85,null,{"$f":"VLOOKUP(C13,'Surface Data 2b'!$E$10:$I$218,5,FALSE)","v":0},0,null,3,{"$f":"VLOOKUP(C13,'Surface Data 2b'!$E$10:$J$218,6,FALSE)","v":0},3]
[null,null,7,-100,0,587.73,null,{"$f":"VLOOKUP(C14,'Surface Data 2b'!$E$10:$I$218,5,FALSE)","v":0},0,null,4,{"$f":"VLOOKUP(C14,'Surface Data 2b'!$E$10:$J$218,6,FALSE)","v":0},4]
[null,null,8,0,0,603.04999999999995,null,{"$f":"VLOOKUP(C15,'Surface Data 2b'!$E$10:$I$218,5,FALSE)","v":0},0,null,3.4285714285714199,{"$f":"VLOOKUP(C15,'Surface Data 2b'!$E$10:$J$218,6,FALSE)","v":0},3.4285714285714199]
[null,null,9,100,0,616.9,null,{"$f":"VLOOKUP(C16,'Surface Data 2b'!$E$10:$I$218,5,FALSE)","v":0},0,null,3.6904761904761898,{"$f":"VLOOKUP(C16,'Surface Data 2b'!$E$10:$J$218,6,FALSE)","v":0},3.6904761904761898]
[null,null,10,300,0,640.83000000000004,null,{"$f":"VLOOKUP(C17,'Surface Data 2b'!$E$10:$I$218,5,FALSE)","v":0},0,null,3.9523809523809499,{"$f":"VLOOKUP(C17,'Surface Data 2b'!$E$10:$J$218,6,FALSE)","v":0},3.9523809523809499]
[null,null,11,350,0,645.92999999999995,null,{"$f":"VLOOKUP(C18,'Surface Data 2b'!$E$10:$I$218,5,FALSE)","v":0},0,null,4.21428571428571,{"$f":"VLOOKUP(C18,'Surface Data 2b'!$E$10:$J$218,6,FALSE)","v":0},4.21428571428571]
[null,null,12,413.1,0,625,null,{"$f":"VLOOKUP(C19,'Surface Data 2b'!$E$10:$I$218,5,FALSE)","v":0},0,null,4.4761904761904701,{"$f":"VLOOKUP(C19,'Surface Data 2b'!$E$10:$J$218,6,FALSE)","v":0},4.4761904761904701]
[null,null,13,464.13,0,625,null,{"$f":"VLOOKUP(C20,'Surface Data 2b'!$E$10:$I$218,5,FALSE)","v":0},0,null,4.7380952380952301,{"$f":"VLOOKUP(C20,'Surface Data 2b'!$E$10:$J$218,6,FALSE)","v":0},4.7380952380952301]
{"$rows_left_out":204}
{"sheet":"Force Plots 2a","index":10,"n_rows":1,"n_cols":2,"rows_kept":1,"cut":false,"hidden":false,"merged":[[0,1,1,13]]}
[null,"Aerodynamic Forces"]

{"sheet":"Velocity Plots 2a","index":11,"n_rows":1,"n_cols":2,"rows_kept":1,"cut":false,"hidden":false,"merged":[[0,1,1,19]]}
[null,"Velocity Profiles"]

{"sheet":"Pressure Probe Plots 2a","index":12,"n_rows":1,"n_cols":2,"rows_kept":1,"cut":false,"hidden":false,"merged":[[0,1,1,24]]}
[null,"Surface Pressure "]

{"sheet":"Skin Friction Plot 2a","index":13,"n_rows":1,"n_cols":2,"rows_kept":1,"cut":false,"hidden":false,"merged":[[0,1,1,24]]}
[null,"Surface Pressure "]

{"sheet":"Force Plots 2b","index":14,"n_rows":1,"n_cols":2,"rows_kept":1,"cut":false,"hidden":false,"merged":[[0,1,1,13]]}
[null,"Aerodynamic Forces"]

{"sheet":"Velocity Plots 2b","index":15,"n_rows":1,"n_cols":2,"rows_kept":1,"cut":false,"hidden":false,"merged":[[0,1,1,19]]}
[null,"Velocity Profiles"]

{"sheet":"Pressure Probe Plots 2b","index":16,"n_rows":1,"n_cols":2,"rows_kept":1,"cut":false,"hidden":false,"merged":[[0,1,1,24]]}
[null,"Surface Pressure "]

{"sheet":"Skin Friction Plot 2b","index":17,"n_rows":1,"n_cols":2,"rows_kept":1,"cut":false,"hidden":false,"merged":[[0,1,1,24]]}
[null,"Surface Pressure "]

{"sheet":"FlowField 2a","index":18,"n_rows":18,"n_cols":5,"rows_kept":18,"cut":false,"hidden":false,"merged":[[1,1,1,2],[2,1,5,1],[6,1,9,1],[10,1,13,1],[14,1,17,1]]}
[]
[null,null,null,{"$f":"#REF!","v":{"$error":"#REF!"}},{"$f":"'META Data'!E17","v":"ID__"}]
[null,"Wake Cross Section @ X = 4007mm","Total Pressure Coef. Cpt [-]"]
[null,null,"Static Pressure Coef. Cp [-]"]
[null,null,"Normalized Velocity V/Voo [-]"]
[null,null,"Microdrag Cdl [-]"]
[null,"Front Wheel Wake Section @ X = 407mm","Total Pressure Coef. Cpt [-]"]
[null,null,"Static Pressure Coef. Cp [-]"]
[null,null,"Normalized Velocity V/Voo [-]"]
[null,null,"Microdrag Cdl [-]"]
[null,"Vehicle Wake Cross Section @ y = 0mm","Total Pressure Coef. Cpt [-]"]
[null,null,"Static Pressure Coef. Cp [-]"]
[null,null,"Normalized Velocity V/Voo [-]"]
[null,null,"Microdrag Cdl [-]"]
[null,"Underbody Section @ z = -237mm","Total Pressure Coef. Cpt [-]"]
[null,null,"Static Pressure Coef. Cp [-]"]
[null,null,"Normalized Velocity V/Voo [-]"]
[null,null,"Microdrag Cdl [-]"]

{"sheet":"FlowField 2b","index":19,"n_rows":18,"n_cols":5,"rows_kept":18,"cut":false,"hidden":false,"merged":[[1,1,1,2],[2,1,5,1],[6,1,9,1],[10,1,13,1],[14,1,17,1]]}
[]
[null,null,null,{"$f":"#REF!","v":{"$error":"#REF!"}},{"$f":"'META Data'!F17","v":"ID__"}]
[null,"Wake Cross Section @ X = 4007mm","Total Pressure Coef. Cpt [-]"]
[null,null,"Static Pressure Coef. Cp [-]"]
[null,null,"Normalized Velocity V/Voo [-]"]
[null,null,"Microdrag Cdl [-]"]
[null,"Front Wheel Wake Section @ X = 407mm","Total Pressure Coef. Cpt [-]"]
[null,null,"Static Pressure Coef. Cp [-]"]
[null,null,"Normalized Velocity V/Voo [-]"]
[null,null,"Microdrag Cdl [-]"]
[null,"Vehicle Wake Cross Section @ y = 0mm","Total Pressure Coef. Cpt [-]"]
[null,null,"Static Pressure Coef. Cp [-]"]
[null,null,"Normalized Velocity V/Voo [-]"]
[null,null,"Microdrag Cdl [-]"]
[null,"Underbody Section @ z = -237mm","Total Pressure Coef. Cpt [-]"]
[null,null,"Static Pressure Coef. Cp [-]"]
[null,null,"Normalized Velocity V/Voo [-]"]
[null,null,"Microdrag Cdl [-]"]